Important: Please read the Qt Code of Conduct - https://forum.qt.io/topic/113070/qt-code-of-conduct

Makefile fail for QT 5.3



  • Hello,

    I tried to install QT 5.3 on GIT with this guide :
    http://qt-project.org/wiki/Qt5ForAndroidBuilding

    And when I type "make -j 5 all", i have this error :
    @make[3]: quittant le répertoire « /home/project-test/qt5/qt5/qtbase/src/tools/bootstrap »
    make[2]: quittant le répertoire « /home/project-test/qt5/qt5/qtbase/src »
    make[1]: *** [sub-src-all] Erreur 2
    make[1]: quittant le répertoire « /home/project-test/qt5/qt5/qtbase »
    make: *** [module-qtbase-all] Erreur 2
    @

    For configure, i use :
    @./configure -xplatform android-g++ -nomake tests -nomake examples -android-ndk /home/project-test/Téléchargements/android-ndk-r9d -android-sdk /home/project-test/adt-bundle-linux-x86_64-20131030/sdk -android-ndk-host linux-x86_64 -android-toolchain-version 4.8 -skip qttranslations -skip qtwebkit -skip qtserialport -skip qtwebkit-examples -no-warnings-are-errors -qreal float@

    I tried to download the source again but I have the same error.
    Someone have an idea?

    OS : Wheezy x64

    Thank you.

    P.S : sorry for my english



  • Hello,

    do you get the same error is you just type make (not make -j 5 all) ?



  • Yes, i have the same error without "-all" like
    @make[1]: *** [sub-src-all] Erreur 2@

    I tri with make and i tell you the exact error



  • This is the errors with only make :
    @make[3]: quittant le répertoire « /home/project-test/qt5/qt5/qtbase/src/tools/qlalr »
    make[2]: quittant le répertoire « /home/project-test/qt5/qt5/qtbase/src »
    make[1]: *** [sub-src-make_first] Erreur 2
    make[1]: quittant le répertoire « /home/project-test/qt5/qt5/qtbase »
    make: *** [module-qtbase-make_first] Erreur 2
    @

    Do you have any idea?



  • Can you post more of the trace?



  • What do you want?
    How I have install QT 5.3?

    Or the entire list of command I used?



  • no, the full trace (or more) of the make command,

    You are receiving an error 2, but probably something went wrong during the make build earlier


Log in to reply