CmakeFiles Error



  • Hello,

    It is a Standard Project from QT, where I have change nothing.
    I have the error:

    15:02:40: Führe Schritte für Projekt unknown_test aus...
    15:02:40: Starte "C:\LegacyApp\cmake-3.0.0-win32-x86\bin\cmake.exe" --build . --target all
    CMakeFiles/unknown_test_automoc.dir/build.make:66: recipe for target 'CMakeFiles/unknown_test_automoc.dir/depend' failed
    gmake.exe[2]: *** [CMakeFiles/unknown_test_automoc.dir/depend] Error 1
    CMakeFiles/Makefile2:95: recipe for target 'CMakeFiles/unknown_test_automoc.dir/all' failed
    makefile:76: recipe for target 'all' failed
    gmake.exe[1]: *** [CMakeFiles/unknown_test_automoc.dir/all] Error 2
    gmake.exe: *** [all] Error 2
    15:02:40: Der Prozess "C:\LegacyApp\cmake-3.0.0-win32-x86\bin\cmake.exe" wurde mit dem Rückgabewert 2 beendet.
    Fehler beim Erstellen/Deployment des Projekts unknown_test (Kit: Desktop Qt 5.9.1 MinGW 32bit)
    Bei der Ausführung von Schritt "CMake Build"
    15:02:40: Verstrichene Zeit: 00:00.

    and do not know where the issue / error ...

    Can anybody held me?


  • Lifetime Qt Champion

    Hi,

    The first thing I'd do is update cmake, the current version is 3.9.2.


Log in to reply
 

Looks like your connection to Qt Forum was lost, please wait while we try to reconnect.