Qt World Summit: Register Today!

Error: [iphonesimulator-debug] Error 65

  • In version 5.3 you got rid of the 65 error by following the instructions here...


    In release 5.4, This "fix" no longer works. The changes made to Xcode project do not "stick" they change back each time qmake is run and you build.

    What is the fix for this now as it seem to be a moving target??

    ** BUILD FAILED **
    The following build commands failed:
    CompileXIB myProject.xcodeproj/LaunchScreen.xib
    (1 failure)
    make[1]: *** [iphonesimulator-debug] Error 65
    make: *** [debug-iphonesimulator] Error 2
    18:08:17: The process "/usr/bin/make" exited with code 2.
    Error while building/deploying project qMarks (kit: iphonesimulator-clang Qt
    5.4.0 for iOS)
    When executing step "Make"

Log in to reply