<?xml version="1.0" encoding="UTF-8"?><rss xmlns:dc="http://purl.org/dc/elements/1.1/" xmlns:content="http://purl.org/rss/1.0/modules/content/" xmlns:atom="http://www.w3.org/2005/Atom" version="2.0"><channel><title><![CDATA[Pyside 1.2.1 compile error (Python 3, QT4.8.5 OSX 10.7.5)]]></title><description><![CDATA[<p dir="auto">Hi, I need help to solve this problem please.</p>
<p dir="auto">I have Pyside 1.2.1 as follows:</p>
<p dir="auto">Gregs-MacBook-Pro-2:PySide-1.2.0 Greg$ ls<br />
<a href="http://MANIFEST.in" target="_blank" rel="noopener noreferrer nofollow ugc">MANIFEST.in</a>   <a href="http://popenasync.py" target="_blank" rel="noopener noreferrer nofollow ugc">popenasync.py</a>   setup.cfg<br />
PKG-INFO   pyside_build   <a href="http://setup.py" target="_blank" rel="noopener noreferrer nofollow ugc">setup.py</a><br />
README.rst   pyside_install   sources<br />
<strong>pycache</strong>   pyside_package   <a href="http://utils.py" target="_blank" rel="noopener noreferrer nofollow ugc">utils.py</a><br />
distribute-0.6.45.tar.gz pyside_postinstall.py<br />
distribute_setup.py  <a href="http://qtinfo.py" target="_blank" rel="noopener noreferrer nofollow ugc">qtinfo.py</a><br />
Gregs-MacBook-Pro-2:PySide-1.2.0 Greg$</p>
<p dir="auto">PyQt4 is installed and works, as does Python 3.3. However when I $ python3 <a href="http://setup.py" target="_blank" rel="noopener noreferrer nofollow ugc">setup.py</a> install I get......</p>
<p dir="auto">In file included from /Users/Greg/Downloads/PySide-1.2.0/sources/pyside/plugins/customwidgets.cpp:23:<br />
/Users/Greg/Downloads/PySide-1.2.0/sources/pyside/plugins/customwidget.h:27:10: fatal error: 'QtDesigner/QtDesigner'<br />
file not found<br />
#include &lt;QtDesigner/QtDesigner&gt;<br />
^<br />
2 warnings and 1 error generated.<br />
make[2]: *** [plugins/CMakeFiles/uiplugin.dir/customwidgets.cpp.o] Error 1<br />
make[1]: *** [plugins/CMakeFiles/uiplugin.dir/all] Error 2<br />
make: *** [all] Error 2<br />
error: Error compiling pyside<br />
Gregs-MacBook-Pro-2:PySide-1.2.0 Greg$</p>
<p dir="auto">What am I doing wrong? This is very frustrating as PySide and PyQt4 works on my windows desktop under eclipse ; PyQt4 works on my MAC under eclipse, yet PySide does not. I need to do both in order to prove the cross-platform capability of PySide.</p>
<p dir="auto">Your help would be appreciated.</p>
<p dir="auto">PS I am new to this game, so clear instructions on how to resolve this problem would be most appreciated.</p>
<p dir="auto">Many thanks in advance.</p>
<p dir="auto">Greg</p>
]]></description><link>https://forum.qt.io/topic/33127/pyside-1-2-1-compile-error-python-3-qt4-8-5-osx-10-7-5</link><generator>RSS for Node</generator><lastBuildDate>Tue, 20 Oct 2026 17:29:31 GMT</lastBuildDate><atom:link href="https://forum.qt.io/topic/33127.rss" rel="self" type="application/rss+xml"/><pubDate>Wed, 16 Oct 2013 08:57:55 GMT</pubDate><ttl>60</ttl></channel></rss>