Error when executing Qt 4.8.5 (Build Debug Libraries)



  • I've installed recently Qt 4.8.5 and when I execute the Build Debug Libraries script everything starts ok but after 3 or 4 minutes appears this error.

    @Makefile.Debug:12559: recipe for target 'tmp/obj/debug_shared/qsimd.o' failed
    mingw32-make[2]: *** [tmp/obj/debug_shared/qsimd.o] Error 1
    mingw32-make[2]: Leaving directory 'C:/Qt/4.8.5/src/corelib'
    Makefile:34: recipe for target 'debug' failed
    mingw32-make[1]: *** [debug] Error 2
    mingw32-make[1]: Leaving directory 'C:/Qt/4.8.5/src/corelib'
    Makefile:1182: recipe for target 'sub-corelib-sub_Debug' failed
    mingw32-make: *** [sub-corelib-sub_Debug] Error 2@

    I'm using a Windos 7 64 bits on a virtual machine but I don't know if this is relevant.


Log in to reply
 

Looks like your connection to Qt Forum was lost, please wait while we try to reconnect.