Skip to content
  • Categories
  • Recent
  • Tags
  • Popular
  • Users
  • Groups
  • Search
  • Get Qt Extensions
  • Unsolved
Collapse
Brand Logo
  1. Home
  2. Qt Development
  3. General and Desktop
  4. FAILED compile for arm.v5.udeb.gcce4_4_1 error
Qt 6.11 is out! See what's new in the release blog

FAILED compile for arm.v5.udeb.gcce4_4_1 error

Scheduled Pinned Locked Moved General and Desktop
7 Posts 3 Posters 4.2k Views 1 Watching
  • Oldest to Newest
  • Newest to Oldest
  • Most Votes
Reply
  • Reply as topic
Log in to reply
This topic has been deleted. Only users with topic management privileges can see it.
  • ? Offline
    ? Offline
    A Former User
    wrote on last edited by
    #1

    hi everyone. i am building an application in qt & it is showing this compiled output. can really make out what is the problem:

    sbs: build log in C:\QtSDK\Symbian\SDKs\Symbian3Qt474\epoc32\build\Makefile.2012-04-30-10-56-30.63-4644.log

    FAILED qmake_extra_pre_targetdep for arm.v5.udeb.gcce4_4_1: epoc32\new2\moc\moc_mydialog27.cpp

    FAILED qmake_extra_pre_targetdep for arm.v5.udeb.gcce4_4_1: epoc32\new2\moc\moc_user_data.cpp

    FAILED qmake_extra_pre_targetdep for arm.v5.udeb.gcce4_4_1: epoc32\new2\moc\moc_mydialog27.cpp

    FAILED qmake_extra_pre_targetdep for arm.v5.udeb.gcce4_4_1: epoc32\new2\moc\moc_user_data.cpp

    FAILED compile for arm.v5.udeb.gcce4_4_1: epoc32\build\new2\c_816283a24d5f3714\new2_exe\armv5\udeb\moc_mydialog27.o
    mmp: new2_exe.mmp

    FAILED compile for arm.v5.udeb.gcce4_4_1: epoc32\build\new2\c_816283a24d5f3714\new2_exe\armv5\udeb\moc_user_data.o
    mmp: new2_exe.mmp
    mingw32-make[1]: *** [C:/QtSDK/Symbian/SDKs/Symbian3Qt474/epoc32/build/new2/c_816283a24d5f3714/new2_exe/armv5/udeb/moc_mydialog27.o] Error 1
    mingw32-make[1]: *** Waiting for unfinished jobs....
    mingw32-make[1]: *** [C:/QtSDK/Symbian/SDKs/Symbian3Qt474/epoc32/build/new2/c_816283a24d5f3714/new2_exe/armv5/udeb/moc_user_data.o] Error 1
    sbs: error: The make-engine exited with errors.
    make.exe: Leaving directory `C:/QtSDK/Symbian/SDKs/Symbian3Qt474/epoc32/new2'
    make.exe: *** [debug-gcce] Error 1
    10:56:41: The process "C:\QtSDK\Symbian\SDKs\Symbian3Qt474\epoc32\tools\make.exe" exited with code 2.
    Error while building project new2 (target: Symbian Device)
    When executing build step 'Make'

    can anybody propose some solution ???

    1 Reply Last reply
    0
    • J Offline
      J Offline
      jmoellmer
      wrote on last edited by
      #2

      What are your build steps? Are you making off the command-line or using QtCreator?

      Programs for sale...

      Fast, Reliable, Cheap: choose two.

      1 Reply Last reply
      0
      • ? Offline
        ? Offline
        A Former User
        wrote on last edited by
        #3

        hi jmoellmer. i am using qt creator 1.2 & building mobile application in it.

        1 Reply Last reply
        0
        • ? Offline
          ? Offline
          A Former User
          wrote on last edited by
          #4

          Qt Creator 1.2 is OLD and symbian and especially sbs support has much improved since those times.

          I suggest getting Qt Creator 2.4.1.

          1 Reply Last reply
          0
          • ? Offline
            ? Offline
            A Former User
            wrote on last edited by
            #5

            thank you tobias hunger. please also provide here the link to download Qt Creator 2.4.1

            1 Reply Last reply
            0
            • ? Offline
              ? Offline
              A Former User
              wrote on last edited by
              #6

              Please follow the "DOWNLOADS" link at the top of this page.

              Are you actually using Qt Creator 1.2 (Check Help->About Qt Creator while running it) or are you using the Qt SDK of version 1.2? Qt SDK 1.2 should have a fairly recent Qt Creator included...

              1 Reply Last reply
              0
              • ? Offline
                ? Offline
                A Former User
                wrote on last edited by
                #7

                hi tobias hunger. i am using qt sdk 1.2. it is based on qt 4.7.4. also, to download qt sdk 2.4, i have followed this link:
                "releases.qt-project.org/qtcreator/source/qt-creator-win-opensource-2.4.1.exe". while installation, it does not highlight the option to install install qt sdk.

                1 Reply Last reply
                0

                • Login

                • Login or register to search.
                • First post
                  Last post
                0
                • Categories
                • Recent
                • Tags
                • Popular
                • Users
                • Groups
                • Search
                • Get Qt Extensions
                • Unsolved